Reaction Details
TargetCarbonic anhydrase 2
LigandBDBM50163861
Substrate/Competitorn/a
Meas. Tech.ChEMBL_1572867 (CHEMBL3801003)
Kd 77±n/a nM
Citation Talibov, VOLinkuviene, VMatulis, DDanielson, UH Kinetically Selective Inhibitors of Human Carbonic Anhydrase Isozymes I, II, VII, IX, XII, and XIII. J Med Chem59:2083-93 (2016) 
 
Carbonic anhydrase 2
Name:Carbonic anhydrase 2
Type:Enzyme
Mol. Mass.:29250.71
Organism:Homo sapiens (Human)
Description:P00918
Residue:260
BDBM50163861
NameBDBM50163861
Synonyms:CHEMBL3799945 | carbonic anhydrase (CA) inhibitors, benzenesulphonamide ligand, 15
TypeSmall organic molecule
Emp. Form.C14H12F4N2O3S
Mol. Mass.364.315
SMILESCOc1ccc(CNc2c(F)c(F)c(F)c(F)c2S(N)(=O)=O)cc1