Reaction Details
TargetCarbonic anhydrase 9
LigandBDBM50163860
Substrate/Competitorn/a
Meas. Tech.ChEMBL_1572874 (CHEMBL3801010)
Kd 10±n/a nM
Citation Talibov, VOLinkuviene, VMatulis, DDanielson, UH Kinetically Selective Inhibitors of Human Carbonic Anhydrase Isozymes I, II, VII, IX, XII, and XIII. J Med Chem59:2083-93 (2016) 
 
Carbonic anhydrase 9
Name:Carbonic anhydrase 9
Type:Enzyme
Mol. Mass.:49669.03
Organism:Homo sapiens (Human)
Description:Catalytic domain of human cloned isozyme was used in the assay
Residue:459
BDBM50163860
NameBDBM50163860
Synonyms:CHEMBL3797893 | carbonic anhydrase (CA) inhibitors, benzenesulphonamide ligand, 16
TypeSmall organic molecule
Emp. Form.C11H12F4N2O2S
Mol. Mass.312.284
SMILESNS(=O)(=O)c1c(F)c(F)c(N2CCCCC2)c(F)c1F