Reaction Details
TargetCarbonic anhydrase 12
LigandBDBM50380148
Substrate/Competitorn/a
Meas. Tech.ChEMBL_1573084 (CHEMBL3802370)
pH8±n/a
Kd 140±n/a nM
Commentsextracted
Citation Talibov, VOLinkuviene, VMatulis, DDanielson, UH Kinetically Selective Inhibitors of Human Carbonic Anhydrase Isozymes I, II, VII, IX, XII, and XIII. J Med Chem59:2083-93 (2016) 
 
Carbonic anhydrase 12
Name:Carbonic anhydrase 12
Type:Enzyme
Mol. Mass.:39456.00
Organism:Homo sapiens (Human)
Description:Catalytic domain of human cloned isozyme was used in the assay
Residue:354
BDBM50380148
NameBDBM50380148
Synonyms:CHEMBL2011156 | carbonic anhydrase (CA) inhibitors, benzenesulphonamide ligand, 6
TypeSmall organic molecule
Emp. Form.C12H11N3O3S2
Mol. Mass.309.364
SMILESNS(=O)(=O)c1ccc(cc1)C(=O)CSc1ncccn1