Reaction Details
TargetTransmembrane domain-containing protein TMIGD3
LigandBDBM50163877
Substrate/Competitorn/a
Meas. Tech.ChEMBL_1573808 (CHEMBL3803229)
Ki 684±n/a nM
Citation Tosh, DKCiancetta, AWarnick, EO'Connor, RChen, ZGizewski, ECrane, SGao, ZGAuchampach, JASalvemini, DJacobson, KA Purine (N)-Methanocarba Nucleoside Derivatives Lacking an Exocyclic Amine as Selective A3 Adenosine Receptor Agonists. J Med Chem59:3249-63 (2016) 
 
Transmembrane domain-containing protein TMIGD3
Name:Transmembrane domain-containing protein TMIGD3
Type:PROTEIN
Mol. Mass.:30335.79
Organism:Homo sapiens (Human)
Description:ChEMBL_114868
Residue:266
BDBM50163877
NameBDBM50163877
Synonyms:CHEMBL3799847
TypeSmall organic molecule
Emp. Form.C20H18ClN5O4S
Mol. Mass.459.906
SMILES[H][C@]12C[C@]1([C@@H](O)[C@@H](O)[C@@H]2n1cnc2c(OC)nc(nc12)C#Cc1ccc(Cl)s1)C(=O)NC