Reaction Details
TargetSphingosine 1-phosphate receptor 1
LigandBDBM50164497
Substrate/Competitorn/a
Meas. Tech.ChEMBL_1574131 (CHEMBL3801746)
EC50 0.980000±n/a nM
Citation Watterson, SHGuo, JSpergel, SHLangevine, CMMoquin, RVShen, DRYarde, MCvijic, MEBanas, DLiu, RSuchard, SJGillooly, KTaylor, TRex-Rabe, SShuster, DJMcIntyre, KWCornelius, GD'Arienzo, CMarino, ABalimane, PWarrack, BSalter-Cid, LMcKinnon, MBarrish, JCCarter, PHPitts, WJXie, JDyckman, AJ Potent and Selective Agonists of Sphingosine 1-Phosphate 1 (S1P1): Discovery and SAR of a Novel Isoxazole Based Series. J Med Chem59:2820-40 (2016) 
 
Sphingosine 1-phosphate receptor 1
Name:Sphingosine 1-phosphate receptor 1
Type:Enzyme
Mol. Mass.:42836.02
Organism:Homo sapiens (Human)
Description:P21453
Residue:382
BDBM50164497
NameBDBM50164497
Synonyms:CHEMBL3800349
TypeSmall organic molecule
Emp. Form.C23H17F3N4O4
Mol. Mass.470.4007
SMILESOC(=O)C1CN(Cc2ccc(cc2)-c2noc(n2)-c2noc(c2C(F)(F)F)-c2ccccc2)C1