Reaction Details
TargetSphingosine 1-phosphate receptor 1
LigandBDBM50164503
Substrate/Competitorn/a
Meas. Tech.ChEMBL_1574131 (CHEMBL3801746)
EC50 0.440000±n/a nM
Citation Watterson, SHGuo, JSpergel, SHLangevine, CMMoquin, RVShen, DRYarde, MCvijic, MEBanas, DLiu, RSuchard, SJGillooly, KTaylor, TRex-Rabe, SShuster, DJMcIntyre, KWCornelius, GD'Arienzo, CMarino, ABalimane, PWarrack, BSalter-Cid, LMcKinnon, MBarrish, JCCarter, PHPitts, WJXie, JDyckman, AJ Potent and Selective Agonists of Sphingosine 1-Phosphate 1 (S1P1): Discovery and SAR of a Novel Isoxazole Based Series. J Med Chem59:2820-40 (2016) 
 
Sphingosine 1-phosphate receptor 1
Name:Sphingosine 1-phosphate receptor 1
Type:Enzyme
Mol. Mass.:42836.02
Organism:Homo sapiens (Human)
Description:P21453
Residue:382
BDBM50164503
NameBDBM50164503
Synonyms:CHEMBL3800257
TypeSmall organic molecule
Emp. Form.C25H24N4O4
Mol. Mass.444.4825
SMILESCCCc1c(noc1-c1nc(no1)-c1ccc(CN2CC(C2)C(O)=O)cc1)-c1ccccc1