Reaction Details
TargetSphingosine 1-phosphate receptor 3
LigandBDBM50164498
Substrate/Competitorn/a
Meas. Tech.ChEMBL_1574132 (CHEMBL3801747)
EC50 1900±n/a nM
Citation Watterson, SHGuo, JSpergel, SHLangevine, CMMoquin, RVShen, DRYarde, MCvijic, MEBanas, DLiu, RSuchard, SJGillooly, KTaylor, TRex-Rabe, SShuster, DJMcIntyre, KWCornelius, GD'Arienzo, CMarino, ABalimane, PWarrack, BSalter-Cid, LMcKinnon, MBarrish, JCCarter, PHPitts, WJXie, JDyckman, AJ Potent and Selective Agonists of Sphingosine 1-Phosphate 1 (S1P1): Discovery and SAR of a Novel Isoxazole Based Series. J Med Chem59:2820-40 (2016) 
 
Sphingosine 1-phosphate receptor 3
Name:Sphingosine 1-phosphate receptor 3
Type:G Protein-Coupled Receptor (GPCR)
Mol. Mass.:42278.13
Organism:Homo sapiens (Human)
Description:Q99500
Residue:378
BDBM50164498
NameBDBM50164498
Synonyms:CHEMBL3798735
TypeSmall organic molecule
Emp. Form.C24H20F2N4O4
Mol. Mass.466.4368
SMILESCC(F)(F)c1c(noc1-c1ccccc1)-c1nc(no1)-c1ccc(CN2CC(C2)C(O)=O)cc1