Reaction Details
TargetCytochrome P450 2C19
LigandBDBM50156672
Substrate/Competitorn/a
Meas. Tech.ChEMBL_1574391 (CHEMBL3803545)
IC50>40000±n/a nM
Citation Watterson, SHGuo, JSpergel, SHLangevine, CMMoquin, RVShen, DRYarde, MCvijic, MEBanas, DLiu, RSuchard, SJGillooly, KTaylor, TRex-Rabe, SShuster, DJMcIntyre, KWCornelius, GD'Arienzo, CMarino, ABalimane, PWarrack, BSalter-Cid, LMcKinnon, MBarrish, JCCarter, PHPitts, WJXie, JDyckman, AJ Potent and Selective Agonists of Sphingosine 1-Phosphate 1 (S1P1): Discovery and SAR of a Novel Isoxazole Based Series. J Med Chem59:2820-40 (2016) 
 
Cytochrome P450 2C19
Name:Cytochrome P450 2C19
Type:Enzyme
Mol. Mass.:55935.47
Organism:Homo sapiens (Human)
Description:P33261
Residue:490
BDBM50156672
NameBDBM50156672
Synonyms:CHEMBL3794064
TypeSmall organic molecule
Emp. Form.C23H17F3N4O4
Mol. Mass.470.4007
SMILESOC(=O)C1CN(Cc2ccc(cc2)-c2noc(n2)-c2onc(c2C(F)(F)F)-c2ccccc2)C1