Reaction Details
TargetBeta-secretase 1
LigandBDBM50398689
Substrate/Competitorn/a
Meas. Tech.ChEMBL_1574683 (CHEMBL3801550)
Ki 6.0±n/a nM
Citation Mandal, MWu, YMisiaszek, JLi, GBuevich, ACaldwell, JPLiu, XMazzola, RDOrth, PStrickland, CVoigt, JWang, HZhu, ZChen, XGrzelak, MHyde, LAKuvelkar, RLeach, PTTerracina, GZhang, LZhang, QMichener, MSSmith, BCox, KGrotz, DFavreau, LMitra, KKazakevich, IMcKittrick, BAGreenlee, WKennedy, MEParker, EMCumming, JNStamford, AW Structure-Based Design of an Iminoheterocyclicß-Site Amyloid Precursor Protein Cleaving Enzyme (BACE) Inhibitor that Lowers Central Aß in Nonhuman Primates. J Med Chem59:3231-48 (2016) 
 
Beta-secretase 1
Name:Beta-secretase 1
Type:Protein
Mol. Mass.:55755.10
Organism:Homo sapiens (Human)
Description:P56817
Residue:501
BDBM50398689
NameBDBM50398689
Synonyms:CHEMBL2178713
TypeSmall organic molecule
Emp. Form.C24H19N7OS
Mol. Mass.453.519
SMILESCN1C(N)=N[C@]2(CN(C[C@H]2C1=O)c1ncccc1C#N)c1cc(cs1)-c1cccc(c1)C#N