Reaction Details
TargetHistamine H2 receptor
LigandBDBM9488
Substrate/Competitorn/a
Meas. Tech.ChEMBL_1574690 (CHEMBL3801557)
Ki 4900±n/a nM
Citation Mandal, MWu, YMisiaszek, JLi, GBuevich, ACaldwell, JPLiu, XMazzola, RDOrth, PStrickland, CVoigt, JWang, HZhu, ZChen, XGrzelak, MHyde, LAKuvelkar, RLeach, PTTerracina, GZhang, LZhang, QMichener, MSSmith, BCox, KGrotz, DFavreau, LMitra, KKazakevich, IMcKittrick, BAGreenlee, WKennedy, MEParker, EMCumming, JNStamford, AW Structure-Based Design of an Iminoheterocyclicß-Site Amyloid Precursor Protein Cleaving Enzyme (BACE) Inhibitor that Lowers Central Aß in Nonhuman Primates. J Med Chem59:3231-48 (2016) 
 
Histamine H2 receptor
Name:Histamine H2 receptor
Type:G Protein-Coupled Receptor (GPCR)
Mol. Mass.:40115.31
Organism:Homo sapiens (Human)
Description:n/a
Residue:359
BDBM9488
NameBDBM9488
Synonyms:US8541427, 1
Typen/a
Emp. Form.C19H19F3N6O2
Mol. Mass.420.3884
SMILESCOc1nc(nc(C)c1F)N1C[C@H]2C(=O)N(C)C(=N)N[C@]2(C1)c1ccc(F)cc1F