Reaction Details
TargetCytochrome P450 3A4
LigandBDBM102937
Substrate/Competitorn/a
Meas. Tech.ChEMBL_1574682 (CHEMBL3801549)
IC50>20000±n/a nM
Citation Mandal, MWu, YMisiaszek, JLi, GBuevich, ACaldwell, JPLiu, XMazzola, RDOrth, PStrickland, CVoigt, JWang, HZhu, ZChen, XGrzelak, MHyde, LAKuvelkar, RLeach, PTTerracina, GZhang, LZhang, QMichener, MSSmith, BCox, KGrotz, DFavreau, LMitra, KKazakevich, IMcKittrick, BAGreenlee, WKennedy, MEParker, EMCumming, JNStamford, AW Structure-Based Design of an Iminoheterocyclicß-Site Amyloid Precursor Protein Cleaving Enzyme (BACE) Inhibitor that Lowers Central Aß in Nonhuman Primates. J Med Chem59:3231-48 (2016) 
 
Cytochrome P450 3A4
Name:Cytochrome P450 3A4
Type:Enzyme
Mol. Mass.:57349.57
Organism:Homo sapiens (Human)
Description:n/a
Residue:503
BDBM102937
NameBDBM102937
Synonyms:US8541427, 8
TypeSmall organic molecule
Emp. Form.C19H18F4N6O2
Mol. Mass.438.3788
SMILESCOc1nc(nc(C)c1F)N1C[C@H]2C(=O)N(C)C(N)=N[C@]2(C1)c1cc(F)c(F)cc1F