Reaction Details
TargetCytochrome P450 3A4
LigandBDBM50164509
Substrate/Competitorn/a
Meas. Tech.ChEMBL_1574682 (CHEMBL3801549)
IC50 18000±n/a nM
Citation Mandal, MWu, YMisiaszek, JLi, GBuevich, ACaldwell, JPLiu, XMazzola, RDOrth, PStrickland, CVoigt, JWang, HZhu, ZChen, XGrzelak, MHyde, LAKuvelkar, RLeach, PTTerracina, GZhang, LZhang, QMichener, MSSmith, BCox, KGrotz, DFavreau, LMitra, KKazakevich, IMcKittrick, BAGreenlee, WKennedy, MEParker, EMCumming, JNStamford, AW Structure-Based Design of an Iminoheterocyclicß-Site Amyloid Precursor Protein Cleaving Enzyme (BACE) Inhibitor that Lowers Central Aß in Nonhuman Primates. J Med Chem59:3231-48 (2016) 
 
Cytochrome P450 3A4
Name:Cytochrome P450 3A4
Type:Enzyme
Mol. Mass.:57349.57
Organism:Homo sapiens (Human)
Description:n/a
Residue:503
BDBM50164509
NameBDBM50164509
Synonyms:CHEMBL3798199
TypeSmall organic molecule
Emp. Form.C17H18ClFN6O2S
Mol. Mass.424.88
SMILES[H][C@@]12CN(C[C@@]1(NC(=N)N(C)C2=O)c1ccc(Cl)s1)c1nc(C)c(F)c(OC)n1