Reaction Details
TargetBeta-secretase 1
LigandBDBM102969
Substrate/Competitorn/a
Meas. Tech.ChEMBL_1574683 (CHEMBL3801550)
Ki 53±n/a nM
Citation Mandal, MWu, YMisiaszek, JLi, GBuevich, ACaldwell, JPLiu, XMazzola, RDOrth, PStrickland, CVoigt, JWang, HZhu, ZChen, XGrzelak, MHyde, LAKuvelkar, RLeach, PTTerracina, GZhang, LZhang, QMichener, MSSmith, BCox, KGrotz, DFavreau, LMitra, KKazakevich, IMcKittrick, BAGreenlee, WKennedy, MEParker, EMCumming, JNStamford, AW Structure-Based Design of an Iminoheterocyclicß-Site Amyloid Precursor Protein Cleaving Enzyme (BACE) Inhibitor that Lowers Central Aß in Nonhuman Primates. J Med Chem59:3231-48 (2016) 
 
Beta-secretase 1
Name:Beta-secretase 1
Type:Protein
Mol. Mass.:55755.10
Organism:Homo sapiens (Human)
Description:P56817
Residue:501
BDBM102969
NameBDBM102969
Synonyms:US8541427, 40
TypeSmall organic molecule
Emp. Form.C19H18F4N6O2
Mol. Mass.438.3788
SMILESCOc1nc(nc(C)c1F)N1C[C@H]2C(=O)N(C)C(N)=N[C@]2(C1)c1c(F)ccc(F)c1F