Reaction Details
TargetHistone deacetylase 6
LigandBDBM50164517
Substrate/Competitorn/a
Meas. Tech.ChEMBL_1575029 (CHEMBL3803864)
IC50 90±n/a nM
Citation Heimburg, TChakrabarti, ALancelot, JMarek, MMelesina, JHauser, ATShaik, TBDuclaud, SRobaa, DErdmann, FSchmidt, MRomier, CPierce, RJJung, MSippl, W Structure-Based Design and Synthesis of Novel Inhibitors Targeting HDAC8 from Schistosoma mansoni for the Treatment of Schistosomiasis. J Med Chem59:2423-35 (2016) 
 
Histone deacetylase 6
Name:Histone deacetylase 6
Type:Chromatin regulator; hydrolase; repressor
Mol. Mass.:131381.51
Organism:Homo sapiens (Human)
Description:Q9UBN7
Residue:1215
BDBM50164517
NameBDBM50164517
Synonyms:CHEMBL3798183
TypeSmall organic molecule
Emp. Form.C18H15N3O3
Mol. Mass.321.33
SMILESCc1ccc(cc1NC(=O)c1ccc2ccccc2n1)C(=O)NO