Reaction Details
TargetHistone deacetylase 8
LigandBDBM50164519
Substrate/Competitorn/a
Meas. Tech.ChEMBL_1575027 (CHEMBL3803862)
IC50 77±n/a nM
Citation Heimburg, TChakrabarti, ALancelot, JMarek, MMelesina, JHauser, ATShaik, TBDuclaud, SRobaa, DErdmann, FSchmidt, MRomier, CPierce, RJJung, MSippl, W Structure-Based Design and Synthesis of Novel Inhibitors Targeting HDAC8 from Schistosoma mansoni for the Treatment of Schistosomiasis. J Med Chem59:2423-35 (2016) 
 
Histone deacetylase 8
Name:Histone deacetylase 8
Type:Enzyme
Mol. Mass.:41749.60
Organism:Homo sapiens (Human)
Description:Q9BY41
Residue:377
BDBM50164519
NameBDBM50164519
Synonyms:CHEMBL3799297
TypeSmall organic molecule
Emp. Form.C16H16N2O5
Mol. Mass.316.3086
SMILESCOc1ccc(cc1)C(=O)Nc1cc(ccc1OC)C(=O)NO