Reaction Details
TargetHistone deacetylase 8
LigandBDBM50397360
Substrate/Competitorn/a
Meas. Tech.ChEMBL_1575027 (CHEMBL3803862)
IC50 78±n/a nM
Citation Heimburg, TChakrabarti, ALancelot, JMarek, MMelesina, JHauser, ATShaik, TBDuclaud, SRobaa, DErdmann, FSchmidt, MRomier, CPierce, RJJung, MSippl, W Structure-Based Design and Synthesis of Novel Inhibitors Targeting HDAC8 from Schistosoma mansoni for the Treatment of Schistosomiasis. J Med Chem59:2423-35 (2016) 
 
Histone deacetylase 8
Name:Histone deacetylase 8
Type:Enzyme
Mol. Mass.:41749.60
Organism:Homo sapiens (Human)
Description:Q9BY41
Residue:377
BDBM50397360
NameBDBM50397360
Synonyms:CHEMBL2170177 | US10188756, Compound CN110
TypeSmall organic molecule
Emp. Form.C17H16N2O3
Mol. Mass.296.3205
SMILESCOc1ccc(Cn2ccc3ccc(cc23)C(=O)NO)cc1