Reaction Details
TargetHistone deacetylase 8
LigandBDBM50164531
Substrate/Competitorn/a
Meas. Tech.ChEMBL_1575026 (CHEMBL3803623)
IC50 92±n/a nM
Citation Heimburg, TChakrabarti, ALancelot, JMarek, MMelesina, JHauser, ATShaik, TBDuclaud, SRobaa, DErdmann, FSchmidt, MRomier, CPierce, RJJung, MSippl, W Structure-Based Design and Synthesis of Novel Inhibitors Targeting HDAC8 from Schistosoma mansoni for the Treatment of Schistosomiasis. J Med Chem59:2423-35 (2016) 
 
Histone deacetylase 8
Name:Histone deacetylase 8
Type:PROTEIN
Mol. Mass.:49771.73
Organism:Schistosoma mansoni
Description:ChEMBL_116785
Residue:440
BDBM50164531
NameBDBM50164531
Synonyms:CHEMBL3799246
TypeSmall organic molecule
Emp. Form.C22H20N2O4
Mol. Mass.376.4052
SMILESCCOc1ccc(cc1NC(=O)c1ccc(cc1)-c1ccccc1)C(=O)NO