Reaction Details
TargetPeptidyl-prolyl cis-trans isomerase D
LigandBDBM50164673
Substrate/Competitorn/a
Meas. Tech.ChEMBL_1575774 (CHEMBL3801393)
Ki 4900±n/a nM
Citation Shore, ERAwais, MKershaw, NMGibson, RRPandalaneni, SLatawiec, DWen, LJaved, MACriddle, DNBerry, NO'Neill, PMLian, LYSutton, R Small Molecule Inhibitors of Cyclophilin D To Protect Mitochondrial Function as a Potential Treatment for Acute Pancreatitis. J Med Chem59:2596-611 (2016) 
 
Peptidyl-prolyl cis-trans isomerase D
Name:Peptidyl-prolyl cis-trans isomerase D
Type:Protein
Mol. Mass.:40766.62
Organism:Homo sapiens (Human)
Description:Q08752
Residue:370
BDBM50164673
NameBDBM50164673
Synonyms:CHEMBL3797905
TypeSmall organic molecule
Emp. Form.C14H20N4O2
Mol. Mass.276.3342
SMILESNc1ccc(CNC(=O)NCC(=O)N2CCCC2)cc1