Reaction Details
TargetAlpha-1D adrenergic receptor
LigandBDBM50164678
Substrate/Competitorn/a
Meas. Tech.ChEBML_1575788
Ki 3.7±n/a nM
Citation Sakauchi, NKohara, YSato, ASuzaki, TImai, YOkabe, YImai, SSaikawa, RNagabukuro, HKuno, HFujita, HKamo, IYoshida, M Discovery of 5-Chloro-1-(5-chloro-2-(methylsulfonyl)benzyl)-2-imino-1,2-dihydropyridine-3-carboxamide (TAK-259) as a Novel, Selective, and Orally Activea1D Adrenoceptor Antagonist with Antiurinary Frequency Effects: Reducing Human Ether-a-go-go-Related Gene (hERG) Liabilities. J Med Chem59:2989-3002 (2016) 
 
Alpha-1D adrenergic receptor
Name:Alpha-1D adrenergic receptor
Type:Enzyme Catalytic Domain
Mol. Mass.:60485.82
Organism:Homo sapiens (Human)
Description:adrenergic Alpha1D ADRA1D HUMAN::P25100
Residue:572
BDBM50164678
NameBDBM50164678
Synonyms:CHEMBL3799912
TypeSmall organic molecule
Emp. Form.C14H12Cl2N4O2
Mol. Mass.339.177
SMILESNC(=O)c1cc(Cl)cc(Cn2cc(Cl)cc(C(N)=O)c2=N)c1