Reaction Details
TargetWD repeat-containing protein 5
LigandBDBM50164787
Substrate/Competitorn/a
Meas. Tech.ChEMBL_1575813 (CHEMBL3801645)
IC50 0.900000±n/a nM
Citation Getlik, MSmil, DZepeda-Velázquez, CBolshan, YPoda, GWu, HDong, AKuznetsova, EMarcellus, RSenisterra, GDombrovski, LHajian, TKiyota, TSchapira, MArrowsmith, CHBrown, PJVedadi, MAl-Awar, R Structure-Based Optimization of a Small Molecule Antagonist of the Interaction Between WD Repeat-Containing Protein 5 (WDR5) and Mixed-Lineage Leukemia 1 (MLL1). J Med Chem59:2478-96 (2016) 
 
WD repeat-containing protein 5
Name:WD repeat-containing protein 5
Type:Protein
Mol. Mass.:36597.13
Organism:Homo sapiens (Human)
Description:P61964
Residue:334
BDBM50164787
NameBDBM50164787
Synonyms:CHEMBL3798088
TypeSmall organic molecule
Emp. Form.C29H46N8O5
Mol. Mass.586.7261
SMILESCC[C@@H]1NC(=O)[C@H](CCCNC(N)=N)NC(=O)[C@@](C)(CCCCNC(=O)[C@H](NC1=O)c1ccccc1)NC(=O)C(C)C