Reaction Details
TargetWD repeat-containing protein 5
LigandBDBM50164790
Substrate/Competitorn/a
Meas. Tech.ChEMBL_1575810 (CHEMBL3801642)
Kd 340±n/a nM
Citation Getlik, MSmil, DZepeda-Velázquez, CBolshan, YPoda, GWu, HDong, AKuznetsova, EMarcellus, RSenisterra, GDombrovski, LHajian, TKiyota, TSchapira, MArrowsmith, CHBrown, PJVedadi, MAl-Awar, R Structure-Based Optimization of a Small Molecule Antagonist of the Interaction Between WD Repeat-Containing Protein 5 (WDR5) and Mixed-Lineage Leukemia 1 (MLL1). J Med Chem59:2478-96 (2016) 
 
WD repeat-containing protein 5
Name:WD repeat-containing protein 5
Type:Protein
Mol. Mass.:36597.13
Organism:Homo sapiens (Human)
Description:P61964
Residue:334
BDBM50164790
NameBDBM50164790
Synonyms:CHEMBL3797611
TypeSmall organic molecule
Emp. Form.C20H21F3N4O3
Mol. Mass.422.4009
SMILESCN1CCN(CC1)c1ccc(cc1NC(=O)c1c(F)c(C)c(F)c(C)c1F)[N+]([O-])=O