Reaction Details
TargetMelanocyte-stimulating hormone receptor
LigandBDBM50034922
Substrate/Competitorn/a
Meas. Tech.ChEMBL_1576041 (CHEMBL3803373)
IC50 388±n/a nM
Citation Lensing, CJFreeman, KTSchnell, SMAdank, DNSpeth, RCHaskell-Luevano, C An in Vitro and in Vivo Investigation of Bivalent Ligands That Display Preferential Binding and Functional Activity for Different Melanocortin Receptor Homodimers. J Med Chem59:3112-28 (2016) 
 
Melanocyte-stimulating hormone receptor
Name:Melanocyte-stimulating hormone receptor
Type:PROTEIN
Mol. Mass.:35238.60
Organism:Mus musculus
Description:ChEMBL_1498846
Residue:315
BDBM50034922
NameBDBM50034922
Synonyms:(S)-2-{(R)-2-[(S)-2-Acetylamino-3-(1H-imidazol-4-yl)-propionylamino]-3-phenyl-propionylamino}-5-guanidino-pentanoic acid [(S)-1-carbamoyl-2-(1H-indol-3-yl)-ethyl]-amide 1N-[1-carbamoyl-2-(1H-3-indolyl)-(1S)-ethyl]-5-amino(imino)methylamino-2-[1-[2-(1H-5-imidazolyl)-1-methylcarboxamido-(1S)-ethylcarboxamido]-2-phenyl-(1R)-ethylcarboxamido]-(2S)-pentanamide Ac-His-DPhe-Arg-Trp-NH2 | CHEMBL264190
TypeSmall organic molecule
Emp. Form.C34H43N11O5
Mol. Mass.685.7759
SMILESCC(=O)N[C@@H](Cc1cnc[nH]1)C(=O)N[C@H](Cc1ccccc1)C(=O)N[C@@H](CCCN=C(N)N)C(=O)N[C@@H](Cc1c[nH]c2ccccc12)C(N)=O