Reaction Details
TargetSphingosine 1-phosphate receptor 1
LigandBDBM50164809
Substrate/Competitorn/a
Meas. Tech.ChEMBL_1576115 (CHEMBL3804199)
EC50 1.000000±n/a nM
Citation Bolli, MHLescop, CBirker, Mde Kanter, RHess, PKohl, CNayler, ORey, MSieber, PVelker, JWeller, TSteiner, B Novel S1P1 receptor agonists - Part 5: From amino-to alkoxy-pyridines. Eur J Med Chem115:326-41 (2016) 
 
Sphingosine 1-phosphate receptor 1
Name:Sphingosine 1-phosphate receptor 1
Type:Enzyme
Mol. Mass.:42836.02
Organism:Homo sapiens (Human)
Description:P21453
Residue:382
BDBM50164809
NameBDBM50164809
Synonyms:CHEMBL3800028
TypeSmall organic molecule
Emp. Form.C27H34N4O6
Mol. Mass.510.5821
SMILESCCc1cc(cc(C)c1OC[C@@H](O)CNC(=O)CO)-c1noc(n1)-c1cc(C)cc(OC2CCCC2)n1