Reaction Details
TargetSphingosine 1-phosphate receptor 1
LigandBDBM50164825
Substrate/Competitorn/a
Meas. Tech.ChEMBL_1576115 (CHEMBL3804199)
EC50 0.400000±n/a nM
Citation Bolli, MHLescop, CBirker, Mde Kanter, RHess, PKohl, CNayler, ORey, MSieber, PVelker, JWeller, TSteiner, B Novel S1P1 receptor agonists - Part 5: From amino-to alkoxy-pyridines. Eur J Med Chem115:326-41 (2016) 
 
Sphingosine 1-phosphate receptor 1
Name:Sphingosine 1-phosphate receptor 1
Type:Enzyme
Mol. Mass.:42836.02
Organism:Homo sapiens (Human)
Description:P21453
Residue:382
BDBM50164825
NameBDBM50164825
Synonyms:CHEMBL3800336
TypeSmall organic molecule
Emp. Form.C27H36N4O6
Mol. Mass.512.5979
SMILESCCC(CC)c1cc(cc(OC)n1)-c1nc(no1)-c1cc(C)c(OC[C@@H](O)CNC(=O)CO)c(CC)c1