Reaction Details
TargetSphingosine 1-phosphate receptor 3
LigandBDBM50164824
Substrate/Competitorn/a
Meas. Tech.ChEMBL_1576116 (CHEMBL3804200)
EC50 27±n/a nM
Citation Bolli, MHLescop, CBirker, Mde Kanter, RHess, PKohl, CNayler, ORey, MSieber, PVelker, JWeller, TSteiner, B Novel S1P1 receptor agonists - Part 5: From amino-to alkoxy-pyridines. Eur J Med Chem115:326-41 (2016) 
 
Sphingosine 1-phosphate receptor 3
Name:Sphingosine 1-phosphate receptor 3
Type:G Protein-Coupled Receptor (GPCR)
Mol. Mass.:42278.13
Organism:Homo sapiens (Human)
Description:Q99500
Residue:378
BDBM50164824
NameBDBM50164824
Synonyms:CHEMBL3799872
TypeSmall organic molecule
Emp. Form.C26H34N4O6
Mol. Mass.498.5714
SMILESCCc1cc(cc(C)c1OC[C@@H](O)CNC(=O)CO)-c1noc(n1)-c1cc(CC(C)C)nc(OC)c1