Reaction Details
TargetNischarin
LigandBDBM50164836
Substrate/Competitorn/a
Meas. Tech.ChEMBL_1576288 (CHEMBL3801425)
Ki 10514±n/a nM
Citation Saczewski, JHudson, AScheinin, MWasilewska, ASaczewski, FRybczynska, AFerdousi, MLaurila, JMBoblewski, KLehmann, AWatts, HMa, D Transfer of SAR information from hypotensive indazole to indole derivatives acting ata-adrenergic receptors: In vitro and in vivo studies. Eur J Med Chem115:406-15 (2016) 
 
Nischarin
Name:Nischarin
Type:Enzyme Catalytic Domain
Mol. Mass.:166460.59
Organism:RAT
Description:Q4G017
Residue:1502
BDBM50164836
NameBDBM50164836
Synonyms:CHEMBL3798967
TypeSmall organic molecule
Emp. Form.C12H13BrClN3
Mol. Mass.314.609
SMILESCl.Brc1ccc2n(CC3=NCCN3)ccc2c1