Reaction Details
TargetNischarin
LigandBDBM50164839
Substrate/Competitorn/a
Meas. Tech.ChEMBL_1576288 (CHEMBL3801425)
Ki 9633±n/a nM
Citation Saczewski, JHudson, AScheinin, MWasilewska, ASaczewski, FRybczynska, AFerdousi, MLaurila, JMBoblewski, KLehmann, AWatts, HMa, D Transfer of SAR information from hypotensive indazole to indole derivatives acting ata-adrenergic receptors: In vitro and in vivo studies. Eur J Med Chem115:406-15 (2016) 
 
Nischarin
Name:Nischarin
Type:Enzyme Catalytic Domain
Mol. Mass.:166460.59
Organism:RAT
Description:Q4G017
Residue:1502
BDBM50164839
NameBDBM50164839
Synonyms:CHEMBL3797661
TypeSmall organic molecule
Emp. Form.C12H13ClFN3
Mol. Mass.253.703
SMILESCl.Fc1cccc2ccn(CC3=NCCN3)c12