Reaction Details
TargetD(2) dopamine receptor
LigandBDBM50164855
Substrate/Competitorn/a
Meas. Tech.ChEMBL_1576315 (CHEMBL3801665)
Ki 2.6±n/a nM
Citation Zou, MFKeck, TMKumar, VDonthamsetti, PMichino, MBurzynski, CSchweppe, CBonifazi, AFree, RBSibley, DRJanowsky, AShi, LJavitch, JANewman, AH Novel Analogues of (R)-5-(Methylamino)-5,6-dihydro-4H-imidazo[4,5,1-ij]quinolin-2(1H)-one (Sumanirole) Provide Clues to Dopamine D2/D3 Receptor Agonist Selectivity. J Med Chem59:2973-88 (2016) 
 
D(2) dopamine receptor
Name:D(2) dopamine receptor
Type:Cell-surface receptors
Mol. Mass.:50647.10
Organism:Homo sapiens (Human)
Description:P14416
Residue:443
BDBM50164855
NameBDBM50164855
Synonyms:CHEMBL3797209
TypeSmall organic molecule
Emp. Form.C19H29N3O
Mol. Mass.315.4531
SMILESCCCN(CCC)[C@@H]1Cc2cccc3n(CCC)c(=O)n(C1)c23