Reaction Details
TargetD(2) dopamine receptor
LigandBDBM50164880
Substrate/Competitorn/a
Meas. Tech.ChEMBL_1576315 (CHEMBL3801665)
Ki 8.1±n/a nM
Citation Zou, MFKeck, TMKumar, VDonthamsetti, PMichino, MBurzynski, CSchweppe, CBonifazi, AFree, RBSibley, DRJanowsky, AShi, LJavitch, JANewman, AH Novel Analogues of (R)-5-(Methylamino)-5,6-dihydro-4H-imidazo[4,5,1-ij]quinolin-2(1H)-one (Sumanirole) Provide Clues to Dopamine D2/D3 Receptor Agonist Selectivity. J Med Chem59:2973-88 (2016) 
 
D(2) dopamine receptor
Name:D(2) dopamine receptor
Type:Cell-surface receptors
Mol. Mass.:50647.10
Organism:Homo sapiens (Human)
Description:P14416
Residue:443
BDBM50164880
NameBDBM50164880
Synonyms:CHEMBL3800165
TypeSmall organic molecule
Emp. Form.C16H23N3O
Mol. Mass.273.3733
SMILESCCCN[C@@H]1Cc2cccc3n(CCC)c(=O)n(C1)c23