Reaction Details
TargetD(2) dopamine receptor
LigandBDBM50020222
Substrate/Competitorn/a
Meas. Tech.ChEMBL_1576315 (CHEMBL3801665)
Ki 2.3±n/a nM
Citation Zou, MFKeck, TMKumar, VDonthamsetti, PMichino, MBurzynski, CSchweppe, CBonifazi, AFree, RBSibley, DRJanowsky, AShi, LJavitch, JANewman, AH Novel Analogues of (R)-5-(Methylamino)-5,6-dihydro-4H-imidazo[4,5,1-ij]quinolin-2(1H)-one (Sumanirole) Provide Clues to Dopamine D2/D3 Receptor Agonist Selectivity. J Med Chem59:2973-88 (2016) 
 
D(2) dopamine receptor
Name:D(2) dopamine receptor
Type:Cell-surface receptors
Mol. Mass.:50647.10
Organism:Homo sapiens (Human)
Description:P14416
Residue:443
BDBM50020222
NameBDBM50020222
Synonyms:(+/-)-7-(dipropylamino)-5,6,7,8-tetrahydronaphthalen-2-ol (R,S) 7-Dipropylamino-5,6,7,8-tetrahydro-naphthalen-2-ol 7-Dipropylamino-5,6,7,8-tetrahydro-naphthalen-2-ol 7-OH-DPAT 7-OH-DPAT,(-) CHEMBL1255966 | CHEMBL285755
TypeSmall organic molecule
Emp. Form.C16H25NO
Mol. Mass.247.3758
SMILESCCCN(CCC)C1CCc2ccc(O)cc2C1