Reaction Details
TargetCalmodulin
LigandBDBM50066066
Substrate/Competitorn/a
Meas. Tech.ChEMBL_1576535 (CHEMBL3803975)
Kd 2900±n/a nM
Citation Bruno, CCavalluzzi, MMRusciano, MRLovece, ACarrieri, APracella, RGiannuzzi, GPolimeno, LViale, MIllario, MFranchini, CLentini, G The chemosensitizing agent lubeluzole binds calmodulin and inhibits Ca(2+)/calmodulin-dependent kinase II. Eur J Med Chem116:36-45 (2016) 
 
Calmodulin
Name:Calmodulin
Type:PROTEIN
Mol. Mass.:16813.73
Organism:Bos taurus
Description:ChEMBL_1458985
Residue:149
BDBM50066066
NameBDBM50066066
Synonyms:(S)-1-[4-(Benzothiazol-2-yl-methyl-amino)-piperidin-1-yl]-3-(3,4-difluoro-phenoxy)-propan-2-ol CHEMBL281724 | LUBELUZOLE
TypeSmall organic molecule
Emp. Form.C22H25F2N3O2S
Mol. Mass.433.515
SMILESCN(C1CCN(C[C@H](O)COc2ccc(F)c(F)c2)CC1)c1nc2ccccc2s1