Reaction Details
TargetCalmodulin
LigandBDBM61401
Substrate/Competitorn/a
Meas. Tech.ChEMBL_1576536 (CHEMBL3803976)
Kd 500±n/a nM
Citation Bruno, CCavalluzzi, MMRusciano, MRLovece, ACarrieri, APracella, RGiannuzzi, GPolimeno, LViale, MIllario, MFranchini, CLentini, G The chemosensitizing agent lubeluzole binds calmodulin and inhibits Ca(2+)/calmodulin-dependent kinase II. Eur J Med Chem116:36-45 (2016) 
 
Calmodulin
Name:Calmodulin
Type:PROTEIN
Mol. Mass.:16813.73
Organism:Bos taurus
Description:ChEMBL_1458985
Residue:149
BDBM61401
NameBDBM61401
Synonyms:3,3-diphenyl-N-(1-phenylethyl)-1-propanamine;hydrochloride 3,3-diphenylpropyl(1-phenylethyl)amine;hydrochloride FENDILINE HYDROCHLORIDE SMR000058827 | cid_5702162
TypeSmall organic molecule
Emp. Form.C23H25N
Mol. Mass.315.4513
SMILESCC(NCCC(c1ccccc1)c1ccccc1)c1ccccc1