Reaction Details
TargetCalmodulin
LigandBDBM50017696
Substrate/Competitorn/a
Meas. Tech.ChEMBL_1576539 (CHEMBL3803979)
IC50 60000±n/a nM
Citation Bruno, CCavalluzzi, MMRusciano, MRLovece, ACarrieri, APracella, RGiannuzzi, GPolimeno, LViale, MIllario, MFranchini, CLentini, G The chemosensitizing agent lubeluzole binds calmodulin and inhibits Ca(2+)/calmodulin-dependent kinase II. Eur J Med Chem116:36-45 (2016) 
 
Calmodulin
Name:Calmodulin
Type:PROTEIN
Mol. Mass.:16813.73
Organism:Bos taurus
Description:ChEMBL_1458985
Residue:149
BDBM50017696
NameBDBM50017696
Synonyms:(2-dimethylamino-2-methyl)ethyl-N-dibenzoparathiazine 10-[2-(dimethylamino)propyl]phenothiazine N,N,alpha-trimethyl-10H-phenothiazine-10-ethanamine PROMETHAZINE proazamine
TypeSmall organic molecule
Emp. Form.C17H20N2S
Mol. Mass.284.419
SMILESCC(CN1c2ccccc2Sc2ccccc12)N(C)C