Reaction Details
Target5'-nucleotidase
LigandBDBM50165145
Substrate/Competitorn/a
Meas. Tech.ChEMBL_1572755 (CHEMBL3804264)
Ki 63±n/a nM
Citation al-Rashida, MBatool, GSattar, AEjaz, SAKhan, SLecka, JSévigny, JHameed, AIqbal, J 2-Alkoxy-3-(sulfonylarylaminomethylene)-chroman-4-ones as potent and selective inhibitors of ectonucleotidases. Eur J Med Chem115:484-94 (2016) 
 
5'-nucleotidase
Name:5'-nucleotidase
Type:Enzyme
Mol. Mass.:63371.54
Organism:Homo sapiens (Human)
Description:P21589
Residue:574
BDBM50165145
NameBDBM50165145
Synonyms:CHEMBL3800455
TypeSmall organic molecule
Emp. Form.C20H22N2O5S
Mol. Mass.402.464
SMILESCCCCOC1Oc2ccccc2C(=O)\C1=C/Nc1ccc(cc1)S(N)(=O)=O