Reaction Details
Target5'-nucleotidase
LigandBDBM50437941
Substrate/Competitorn/a
Meas. Tech.ChEMBL_1572756 (CHEMBL3804265)
Ki 47±n/a nM
Citation al-Rashida, MBatool, GSattar, AEjaz, SAKhan, SLecka, JSévigny, JHameed, AIqbal, J 2-Alkoxy-3-(sulfonylarylaminomethylene)-chroman-4-ones as potent and selective inhibitors of ectonucleotidases. Eur J Med Chem115:484-94 (2016) 
 
5'-nucleotidase
Name:5'-nucleotidase
Type:Enzyme
Mol. Mass.:63971.44
Organism:Rattus norvegicus (Rat)
Description:P21588
Residue:576
BDBM50437941
NameBDBM50437941
Synonyms:CHEMBL1814397
TypeSmall organic molecule
Emp. Form.C18H17FN2O5S
Mol. Mass.392.401
SMILESCCOC1Oc2ccc(F)cc2C(=O)C1=CNc1cccc(c1)S(N)(=O)=O