Reaction Details
Target5'-nucleotidase
LigandBDBM50437933
Substrate/Competitorn/a
Meas. Tech.ChEMBL_1572756 (CHEMBL3804265)
Ki 4.7±n/a nM
Citation al-Rashida, MBatool, GSattar, AEjaz, SAKhan, SLecka, JSévigny, JHameed, AIqbal, J 2-Alkoxy-3-(sulfonylarylaminomethylene)-chroman-4-ones as potent and selective inhibitors of ectonucleotidases. Eur J Med Chem115:484-94 (2016) 
 
5'-nucleotidase
Name:5'-nucleotidase
Type:Enzyme
Mol. Mass.:63971.44
Organism:Rattus norvegicus (Rat)
Description:P21588
Residue:576
BDBM50437933
NameBDBM50437933
Synonyms:CHEMBL2408703
TypeSmall organic molecule
Emp. Form.C20H22N2O5S
Mol. Mass.402.464
SMILESCCOC1Oc2ccc(CC)cc2C(=O)C1=CNc1ccccc1S(N)(=O)=O