Reaction Details
Target5'-nucleotidase
LigandBDBM50165126
Substrate/Competitorn/a
Meas. Tech.ChEMBL_1572756 (CHEMBL3804265)
Ki 52±n/a nM
Citation al-Rashida, MBatool, GSattar, AEjaz, SAKhan, SLecka, JSévigny, JHameed, AIqbal, J 2-Alkoxy-3-(sulfonylarylaminomethylene)-chroman-4-ones as potent and selective inhibitors of ectonucleotidases. Eur J Med Chem115:484-94 (2016) 
 
5'-nucleotidase
Name:5'-nucleotidase
Type:Enzyme
Mol. Mass.:63971.44
Organism:Rattus norvegicus (Rat)
Description:P21588
Residue:576
BDBM50165126
NameBDBM50165126
Synonyms:CHEMBL3797319
TypeSmall organic molecule
Emp. Form.C23H22N4O6S
Mol. Mass.482.509
SMILESCCOC1Oc2ccccc2C(=O)\C1=C/Nc1ccc(cc1)S(=O)(=O)Nc1ccc(OC)nn1