Reaction Details
Target5'-nucleotidase
LigandBDBM50165133
Substrate/Competitorn/a
Meas. Tech.ChEMBL_1572756 (CHEMBL3804265)
IC50 10100±n/a nM
Citation al-Rashida, MBatool, GSattar, AEjaz, SAKhan, SLecka, JSévigny, JHameed, AIqbal, J 2-Alkoxy-3-(sulfonylarylaminomethylene)-chroman-4-ones as potent and selective inhibitors of ectonucleotidases. Eur J Med Chem115:484-94 (2016) 
 
5'-nucleotidase
Name:5'-nucleotidase
Type:Enzyme
Mol. Mass.:63971.44
Organism:Rattus norvegicus (Rat)
Description:P21588
Residue:576
BDBM50165133
NameBDBM50165133
Synonyms:CHEMBL3798620
TypeSmall organic molecule
Emp. Form.C17H14Cl2N2O5S
Mol. Mass.429.274
SMILESCOC1Oc2c(Cl)cc(Cl)cc2C(=O)\C1=C/Nc1ccc(cc1)S(N)(=O)=O