Reaction Details
Target5'-nucleotidase
LigandBDBM50437936
Substrate/Competitorn/a
Meas. Tech.ChEMBL_1572756 (CHEMBL3804265)
IC50 2710±n/a nM
Citation al-Rashida, MBatool, GSattar, AEjaz, SAKhan, SLecka, JSévigny, JHameed, AIqbal, J 2-Alkoxy-3-(sulfonylarylaminomethylene)-chroman-4-ones as potent and selective inhibitors of ectonucleotidases. Eur J Med Chem115:484-94 (2016) 
 
5'-nucleotidase
Name:5'-nucleotidase
Type:Enzyme
Mol. Mass.:63971.44
Organism:Rattus norvegicus (Rat)
Description:P21588
Residue:576
BDBM50437936
NameBDBM50437936
Synonyms:CHEMBL2408700
TypeSmall organic molecule
Emp. Form.C16H11FN2O4S
Mol. Mass.346.333
SMILESFc1ccc2occ(C3Nc4ccccc4S(=O)(=O)N3)c(=O)c2c1