Reaction Details
Target5'-nucleotidase
LigandBDBM50437940
Substrate/Competitorn/a
Meas. Tech.ChEMBL_1572756 (CHEMBL3804265)
IC50 6130±n/a nM
Citation al-Rashida, MBatool, GSattar, AEjaz, SAKhan, SLecka, JSévigny, JHameed, AIqbal, J 2-Alkoxy-3-(sulfonylarylaminomethylene)-chroman-4-ones as potent and selective inhibitors of ectonucleotidases. Eur J Med Chem115:484-94 (2016) 
 
5'-nucleotidase
Name:5'-nucleotidase
Type:Enzyme
Mol. Mass.:63971.44
Organism:Rattus norvegicus (Rat)
Description:P21588
Residue:576
BDBM50437940
NameBDBM50437940
Synonyms:CHEMBL1814398
TypeSmall organic molecule
Emp. Form.C18H17BrN2O5S
Mol. Mass.453.307
SMILESCCOC1Oc2ccc(Br)cc2C(=O)C1=CNc1cccc(c1)S(N)(=O)=O