Reaction Details
Target5'-nucleotidase
LigandBDBM50437934
Substrate/Competitorn/a
Meas. Tech.ChEMBL_1572756 (CHEMBL3804265)
IC50 40100±n/a nM
Citation al-Rashida, MBatool, GSattar, AEjaz, SAKhan, SLecka, JSévigny, JHameed, AIqbal, J 2-Alkoxy-3-(sulfonylarylaminomethylene)-chroman-4-ones as potent and selective inhibitors of ectonucleotidases. Eur J Med Chem115:484-94 (2016) 
 
5'-nucleotidase
Name:5'-nucleotidase
Type:Enzyme
Mol. Mass.:63971.44
Organism:Rattus norvegicus (Rat)
Description:P21588
Residue:576
BDBM50437934
NameBDBM50437934
Synonyms:CHEMBL2408702
TypeSmall organic molecule
Emp. Form.C18H16Br2N2O5S
Mol. Mass.532.203
SMILESCCOC1Oc2c(Br)cc(Br)cc2C(=O)C1=CNc1ccccc1S(N)(=O)=O