Reaction Details
TargetSimilar to alpha-tubulin isoform 1
LigandBDBM50005480
Substrate/Competitorn/a
Meas. Tech.ChEMBL_1572779 (CHEMBL3804503)
IC50 1200±n/a nM
Citation Singh, HKumar, MNepali, KGupta, MKSaxena, AKSharma, SBedi, PMS Triazole tethered C5-curcuminoid-coumarin based molecular hybrids as novel antitubulin agents: Design, synthesis, biological investigation and docking studies. Eur J Med Chem116:102-115 (2016) 
 
Similar to alpha-tubulin isoform 1
Name:Similar to alpha-tubulin isoform 1
Synonyms:Similar to alpha-tubulin isoform 1
Type:PROTEIN
Mol. Mass.:10383.05
Organism:Bos taurus
Description:ChEMBL_104716
Residue:99
BDBM50005480
NameBDBM50005480
TypeSmall organic molecule
Emp. Form.C18H20O5
Mol. Mass.316.3484
SMILESCOc1ccc(\C=C/c2cc(OC)c(OC)c(OC)c2)cc1O