Reaction Details
TargetGlutamate receptor ionotropic, NMDA 2B
LigandBDBM50007677
Substrate/Competitorn/a
Meas. Tech.ChEMBL_1572788 (CHEMBL3804512)
Ki 10.0±n/a nM
Citation Lütnant, ISchepmann, DWünsch, B Benzimidazolone bioisosteres of potent GluN2B selective NMDA receptor antagonists. Eur J Med Chem116:136-146 (2016) 
 
Glutamate receptor ionotropic, NMDA 2B
Name:Glutamate receptor ionotropic, NMDA 2B
Type:PROTEIN
Mol. Mass.:166375.46
Organism:Homo sapiens (Human)
Description:ChEMBL_1438829
Residue:1484
BDBM50007677
NameBDBM50007677
Synonyms:(+)-threo 4-[2-(4-Benzyl-piperidin-1-yl)-1-hydroxy-propyl]-phenol 4-[(1S,2S)-2-(4-Benzyl-piperidin-1-yl)-1-hydroxy-propyl]-phenol CHEMBL319706 | Ifenprodil
TypeSmall organic molecule
Emp. Form.C21H27NO2
Mol. Mass.325.4446
SMILESC[C@@H]([C@@H](O)c1ccc(O)cc1)N1CCC(Cc2ccccc2)CC1