Reaction Details
TargetSphingosine 1-phosphate receptor 1
LigandBDBM50165413
Substrate/Competitorn/a
Meas. Tech.ChEMBL_1573233 (CHEMBL3803473)
EC50 3.2±n/a nM
Citation Lescop, CMüller, CMathys, BBirker, Mde Kanter, RKohl, CHess, PNayler, ORey, MSieber, PSteiner, BWeller, TBolli, MH Novel S1P1 receptor agonists - Part 4: Alkylaminomethyl substituted aryl head groups. Eur J Med Chem116:222-238 (2016) 
 
Sphingosine 1-phosphate receptor 1
Name:Sphingosine 1-phosphate receptor 1
Type:Enzyme
Mol. Mass.:42836.02
Organism:Homo sapiens (Human)
Description:P21453
Residue:382
BDBM50165413
NameBDBM50165413
Synonyms:CHEMBL3799026
TypeSmall organic molecule
Emp. Form.C28H39N5O5
Mol. Mass.525.6398
SMILESCCc1cc(cc(C)c1OC[C@@H](O)CNC(=O)CO)-c1noc(n1)-c1cc(C)nc(CN(C)CC(C)C)c1