Reaction Details
TargetSphingosine 1-phosphate receptor 3
LigandBDBM50165391
Substrate/Competitorn/a
Meas. Tech.ChEMBL_1573232 (CHEMBL3803472)
EC50 3200±n/a nM
Citation Lescop, CMüller, CMathys, BBirker, Mde Kanter, RKohl, CHess, PNayler, ORey, MSieber, PSteiner, BWeller, TBolli, MH Novel S1P1 receptor agonists - Part 4: Alkylaminomethyl substituted aryl head groups. Eur J Med Chem116:222-238 (2016) 
 
Sphingosine 1-phosphate receptor 3
Name:Sphingosine 1-phosphate receptor 3
Type:G Protein-Coupled Receptor (GPCR)
Mol. Mass.:42278.13
Organism:Homo sapiens (Human)
Description:Q99500
Residue:378
BDBM50165391
NameBDBM50165391
Synonyms:CHEMBL3798420
TypeSmall organic molecule
Emp. Form.C26H34N4O5
Mol. Mass.482.572
SMILESCCc1cc(cc(C)c1OC[C@@H](O)CNC(=O)CO)-c1noc(n1)-c1ccc(CN(C)C)c(C)c1