Reaction Details
TargetCannabinoid receptor 1
LigandBDBM50062498
Substrate/Competitorn/a
Meas. Tech.ChEMBL_1574214 (CHEMBL3802219)
Ki 656±n/a nM
Citation Bertini, SChicca, AArena, CChicca, SSaccomanni, GGertsch, JManera, CMacchia, M Synthesis and pharmacological evaluation of new biphenylic derivatives as CB2 receptor ligands. Eur J Med Chem116:252-266 (2016) 
 
Cannabinoid receptor 1
Name:Cannabinoid receptor 1
Type:G Protein-Coupled Receptor (GPCR)
Mol. Mass.:52868.96
Organism:Homo sapiens (Human)
Description:P21554
Residue:472
BDBM50062498
NameBDBM50062498
Synonyms:CHEMBL3397448
TypeSmall organic molecule
Emp. Form.C22H27NO2
Mol. Mass.337.4553
SMILESCOc1c(C)cc(cc1C(=O)NC1CCCCCC1)-c1ccccc1