Reaction Details
TargetCannabinoid receptor 1
LigandBDBM50165684
Substrate/Competitorn/a
Meas. Tech.ChEMBL_1574214 (CHEMBL3802219)
Ki 6111±n/a nM
Citation Bertini, SChicca, AArena, CChicca, SSaccomanni, GGertsch, JManera, CMacchia, M Synthesis and pharmacological evaluation of new biphenylic derivatives as CB2 receptor ligands. Eur J Med Chem116:252-266 (2016) 
 
Cannabinoid receptor 1
Name:Cannabinoid receptor 1
Type:G Protein-Coupled Receptor (GPCR)
Mol. Mass.:52868.96
Organism:Homo sapiens (Human)
Description:P21554
Residue:472
BDBM50165684
NameBDBM50165684
Synonyms:CHEMBL3799151
TypeSmall organic molecule
Emp. Form.C25H32FNO2
Mol. Mass.397.5255
SMILESCCCCc1cc(cc(C(=O)NC2CCCCCC2)c1OC)-c1ccc(F)cc1