Reaction Details
TargetCannabinoid receptor 2
LigandBDBM50157304
Substrate/Competitorn/a
Meas. Tech.ChEMBL_1574215 (CHEMBL3802220)
Ki 5.6±n/a nM
Citation Bertini, SChicca, AArena, CChicca, SSaccomanni, GGertsch, JManera, CMacchia, M Synthesis and pharmacological evaluation of new biphenylic derivatives as CB2 receptor ligands. Eur J Med Chem116:252-266 (2016) 
 
Cannabinoid receptor 2
Name:Cannabinoid receptor 2
Type:G Protein-Coupled Receptor (GPCR)
Mol. Mass.:39690.94
Organism:Homo sapiens (Human)
Description:P34972
Residue:360
BDBM50157304
NameBDBM50157304
Synonyms:3',5-di-2-propenyl-1,1'-biphenyl-2,4'-diol 5,3''-Diallyl-biphenyl-2,4''-diol CHEMBL16901 Honokiol, HO | cid_72303
TypeSmall organic molecule
Emp. Form.C18H18O2
Mol. Mass.266.3343
SMILESOc1ccc(cc1CC=C)-c1cc(CC=C)ccc1O