Reaction Details
TargetCannabinoid receptor 2
LigandBDBM50165679
Substrate/Competitorn/a
Meas. Tech.ChEMBL_1574215 (CHEMBL3802220)
Ki 811±n/a nM
Citation Bertini, SChicca, AArena, CChicca, SSaccomanni, GGertsch, JManera, CMacchia, M Synthesis and pharmacological evaluation of new biphenylic derivatives as CB2 receptor ligands. Eur J Med Chem116:252-266 (2016) 
 
Cannabinoid receptor 2
Name:Cannabinoid receptor 2
Type:G Protein-Coupled Receptor (GPCR)
Mol. Mass.:39690.94
Organism:Homo sapiens (Human)
Description:P34972
Residue:360
BDBM50165679
NameBDBM50165679
Synonyms:CHEMBL3797983
TypeSmall organic molecule
Emp. Form.C29H32FNO3
Mol. Mass.461.5677
SMILESCOc1ccc(cc1)-c1cc(Cc2ccc(F)cc2)c(OC)c(c1)C(=O)N[C@H]1CC[C@H](C)CC1