Reaction Details
TargetCannabinoid receptor 2
LigandBDBM50165683
Substrate/Competitorn/a
Meas. Tech.ChEMBL_1574215 (CHEMBL3802220)
Ki 1413±n/a nM
Citation Bertini, SChicca, AArena, CChicca, SSaccomanni, GGertsch, JManera, CMacchia, M Synthesis and pharmacological evaluation of new biphenylic derivatives as CB2 receptor ligands. Eur J Med Chem116:252-266 (2016) 
 
Cannabinoid receptor 2
Name:Cannabinoid receptor 2
Type:G Protein-Coupled Receptor (GPCR)
Mol. Mass.:39690.94
Organism:Homo sapiens (Human)
Description:P34972
Residue:360
BDBM50165683
NameBDBM50165683
Synonyms:CHEMBL3798087
TypeSmall organic molecule
Emp. Form.C25H32FNO2
Mol. Mass.397.5255
SMILESCCCCc1cc(cc(C(=O)N[C@@H]2CC[C@H](C)CC2)c1OC)-c1ccc(F)cc1